{"text_format":"1","workbook":"xlsx","n_sheets":8,"sheets":["Introduction and guidance","Diet input details","Flock input details","Results","References and assumptions log","Data tables","Performance Data","Dataset"],"not_rendered":{"charts":0,"images":5,"macros":1,"external_links":1,"defined_names":8,"comments":0,"pivot_tables":0},"unopened":[],"bounds":{"document_bytes":16777216,"sheet_cells":100000,"rows_first":2000,"rows_last":500,"rows_between":2000,"halvings":0,"cell_chars":16384,"cell_head_chars":4096},"cells_cut":0,"cells_raw":0,"read":"whole","date_system":"1900"}

{"sheet":"Introduction and guidance","index":0,"n_rows":65,"n_cols":34,"rows_kept":65,"cut":false,"hidden":false,"merged":[[41,3,42,13],[41,14,42,16],[43,3,63,15],[33,12,33,15],[34,3,34,5],[34,6,34,7],[34,8,34,11],[34,12,34,15],[35,3,35,15],[36,3,37,15],[38,3,38,15],[39,3,39,15],[40,3,40,4],[40,5,40,7],[40,8,40,10],[40,11,40,13],[33,3,33,5],[33,6,33,7],[33,8,33,11],[9,3,12,15],[14,3,15,15],[16,3,17,15],[18,3,31,15],[32,3,32,15]]}
[]
[]
[]
[]
[]
[]
[]
[]
[]
[null,null,null,"Layer excreta mass balance model"]
{"$rows_left_out":56}
{"sheet":"Diet input details","index":1,"n_rows":24,"n_cols":8,"rows_kept":24,"cut":false,"hidden":false,"merged":[[2,7,24,11],[23,1,23,2],[3,1,3,4],[22,1,22,3],[13,1,13,5]]}
[null,null,null,null,"Input data - diet details"]
[]
[null,"Diet input table 1:",null,null,null,null,null,"\nFlock details input instructions\n\nPlease note: One complete workbook needs to be filled out per management system on your farm.  \n\nDiet input table 1:\nPlease input protein and phosphorus levels (values can be found on all feed declaration tickets) for the appropriate diets in the white boxes in the \"Diet Details\" table.\nIf the diets are the same between phases, then please put the same protein and phosphorus values in both respective sets of boxes.\nIf feed diet groups are not used then leave the cells blank and move on to the next used group.\nThere is a separate row for composition of Whole Wheat. If Whole Wheat is not fed these cells can be left blank.\n\nDiet input table 2:\nEnter the start and end weeks within the production cycle for each diet including the proportion (percentage of total ration fed) of the diet that is made up using Whole Wheat in the final column.\nThe feed start week must be at least 16 and the feed end week must be no more than 100.\nIf Whole Wheat is not fed these cells can be left blank.\n\nDiet input table 3:\nState if phytase is used within the diet. This is a drop down box with Absent or Present. Present represents inlcusion of phytase at a rate of 1,000 FTU/kg of feed."]
[null,"Diet Details"]
[null,"Diet","Crude Protein (%)","Total Nitrogen (%)","Total Phosphorus (%)"]
[null,"Ration 1",null,{"$f":"IF(C6=\"\",\"\",C6/6.25)","v":""}]
[null,"Ration 2",null,""]
[null,"Ration 3",null,""]
[null,"Ration 4",null,""]
[null,"Ration 5",null,""]
{"$rows_left_out":15}
{"sheet":"Flock input details","index":2,"n_rows":22,"n_cols":14,"rows_kept":22,"cut":false,"hidden":false,"merged":[[20,7,24,8],[20,10,24,11],[20,13,24,14],[2,6,18,15]]}
[null,null,null,"Input data - flock details"]
[]
[null,"Flock input table 1:",null,null,null,null,"Flock details input instructions\n\nFlock input table 1:\nEnter number of birds per cycle and number of days between the final clearance and the next cycle in the two white boxes. The number of birds per cycle entry cell will go red if the value entered is below 40,000 rearing places, the BAT regulation limit. If you have under 40,000 birds you can still use this tool as normal.\nSelect the most appropriate flock type for your system. Included flock types are Brown free-range, Brown colony and White free-range.\n\nFlock input table 2 (optional):\nEnter a value for the final bodyweight of birds in your flock. The difference between your value and the target value from performance objectives will be calculated. This difference will be used to update the performance data to more accurately reflect your system.\nIf this table is left blank the standard performance data will be used.  \n\nFlock input table 3:\nThis table is to help calculate the mortality rate across the production cycle.  The No. of birds at start of Ration 1 is equal to Number of birds per cycle in Table 1.  In the following white cells, please indicate the number of birds at the end of each feed ration. The mortality rate will be calcualted and applied to the backround calculations."]
[null,"Per Shed/Farm"]
[null,"Number of birds per cycle"]
[null,"Weeks empty between cycles"]
[null,"Cycle Length in Weeks ",{"$f":"IF('Diet input details'!D17=\"\",'Diet input details'!D16-'Diet input details'!C16,IF('Diet input details'!D18=\"\",'Diet input details'!D17-'Diet input details'!C16,IF('Diet input details'!D19=\"\",'Diet input details'!D18-'Diet input details'!C16,IF('Diet input details'!D20=\"\",'Diet input details'!D19-'Diet input details'!C16,'Diet input details'!D20-'Diet input details'!C16))))","v":0}]
[null,"Flock Type","Please select"]
[]
[]
{"$rows_left_out":13}
{"sheet":"Results","index":3,"n_rows":28,"n_cols":11,"rows_kept":28,"cut":false,"hidden":false,"merged":[[6,10,17,14],[3,1,3,2],[7,1,7,3],[8,1,8,3],[6,1,6,7],[7,4,7,7],[8,4,8,7],[25,5,25,7],[26,5,26,7],[27,5,27,7],[11,1,11,3],[10,1,10,7],[11,4,11,7],[25,2,25,3],[26,2,26,3],[27,2,27,3],[24,2,24,7],[19,2,19,4],[19,7,19,8],[14,2,14,4],[14,7,14,8]]}
[null,null,null,null,"Export data - emission levels"]
[]
[]
[null,"Installation name:",null,{"$f":"'Introduction and guidance'!$F$41","v":0},null,null,"Permit Number:",null,{"$f":"'Introduction and guidance'!$L$41","v":0}]
[]
[]
[null,"BAT Emission Level",null,null,null,null,null,null,null,null,"\nUse the data given in this box to demonstrate compliance with the nitrogen and phosphorus excretion levels.\n\nBased on the data entered within the diet and flock details input the emission levels are calculated within the BAT Emission level box, and colour coded green to show compliance with the upper limits of the BAT standards. If the cells turn red then the emission levels are not compliant.\n\n   -  Nitrogen upper limit = 0.4-0.8kg N/animal/place/year\n   -  Phosphorus upper limit = 0.10-0.45kg P/animal place/year \n\n\n"]
[null,"Nitrogen excreted\nPer animal place (kg N/ Year)",null,null,"Phosphorus excreted\nPer animal place (kg P/ Year)"]
[null,{"$f":"H22","v":{"$error":"#DIV/0!"}},null,null,{"$f":"I22","v":{"$error":"#DIV/0!"}}]
[]
{"$rows_left_out":19}
{"sheet":"References and assumptions log","index":4,"n_rows":16,"n_cols":10,"rows_kept":16,"cut":false,"hidden":true,"merged":[]}
["References and assumptions log"]
[]
["Unique ID","Description with key details ","Location in workbook","Link to evidence","Date of last update","Initials","Methodology behind assumption","Assumptions","Any other comments","Reference or assumption"]
["Layer 01","This table presents performance data on layers taken from Hyline performance guides",{"$f":"CELL(\"address\",'Data tables'!B4)","v":"'[Layers_Model draft_V5_Password protected.xlsm]Data tables'!$B$4"},"White - https://www.hyline.co.uk/services/management-guides/\nBrown - https://www.hyline.co.uk/services/management-guides/","2023-03-22","LR","This data has been used to pull out body weight, cumulative intake, feed conversion ratio, and egg production vales for poultry.","Assumed this data is accurate and representative of standard performance.  ","The data used is for Hyline breeds as this was found to be one of the most common breeds of layer hens in the UK. Lohmann was considered but there was low data availability","Reference"]
["Layer 02","Nitrogen Conversion Factor",{"$f":"CELL(\"address\",'Data tables'!B272)","v":"'[Layers_Model draft_V5_Password protected.xlsm]Data tables'!$B$272"},"Standardised conversion factor in nutritional calculations","2023-03-22","LR","This factor is used to convert crude protein content of feed to nitrogen.","Does not consider specifics of individual feeds but is a standardised factor used within the industry.","None.","Reference"]
["Layer 03","Effect of Phytase on intake and excretion of dry matter, phosphorus, and nitrogen ",{"$f":"CELL(\"address\",'Data tables'!B280)","v":"'[Layers_Model draft_V5_Password protected.xlsm]Data tables'!$B$280"},"Effects of phytase supplementation on production performance, egg and bone quality, plasma biochemistry and mineral excretion of layers fed varying levels of phosphorus | Elsevier Enhanced Reader","2023-03-22","LR","This data has been used to calculate the impact of including phytase in the diet on the excretion of phosphorus.","This paper is assumed to reflect standard production in the UK, and the impact to be replicable.","This reference can be updated should a more appropriate one be discovered","Reference"]
["Layer 04","Phytase feed additives effect on nitrogen","None","None","2023-03-22","LR","None","Within the model calculations nitrogen is not impacted by phytase, this is an assumption based on current literature. ","This can be updated in the model a link is found.","Assumption"]
["Layer 05","Nutrient content of eggs",{"$f":"CELL(\"address\",'Data tables'!B303)","v":"'[Layers_Model draft_V5_Password protected.xlsm]Data tables'!$B$303"},"Defra_WT1568_14860_WT1568WorkPackage6. (1).pdf","2023-03-22","LR","This data has been used to calculate the nutrient content of eggs.","This data is referenced in the DEFRA BAT document so is assumed to be accurate for UK production ","This is a non-excretion output of the mass balance model.  This can be updated should new data become available ","Reference"]
["Layer 06","Nitrogen Content of Layer Liveweight",{"$f":"CELL(\"address\",'Data tables'!B312)","v":"'[Layers_Model draft_V5_Password protected.xlsm]Data tables'!$B$312"},"Defra_WT1568_14860_WT1568WorkPackage6. (1).pdf","2023-03-30","LR","This document contain a value for phosphorus concentration of layer liveweight","This data was used to calculate the amount of nitrogen retained in the liveweight of the bird.  This is used to calculate excretion","The value in this paper is from a different source.  It has been used in this model as it is used in the DEFRA calculations and so assumed to be appropriate.  This can be updated if more appropriate data becomes available ","Reference"]
["Layer 07","Phosphorus Content of Layer Liveweight ",{"$f":"CELL(\"address\",'Data tables'!B312)","v":"'[Layers_Model draft_V5_Password protected.xlsm]Data tables'!$B$312"},"Defra_WT1568_14860_WT1568WorkPackage6. (1).pdf","2023-03-30","LR","This document contains a value for nitrogen concentration of layer liveweight","This data was used to calculate the amount of phosphorus retained in the liveweight of the bird.  This is used to calculate excretion","The value in this paper is from a different source.  It has been used in this model as it is used in the DEFRA calculations and so assumed to be appropriate.  This can be updated if more appropriate data becomes available ","Reference"]
{"$rows_left_out":7}
{"sheet":"Data tables","index":5,"n_rows":334,"n_cols":11,"rows_kept":334,"cut":false,"hidden":true,"merged":[]}
["Data tables holding background data"]
[]
["Table 1. HyLine Brown Colony Performance Data"]
["Source: ","Layer 01"]
["This table presents performance data on layers taken from HyLine production guides"]
[]
["AGE\n(weeks)","%\nHEN-DAY\nCurrent","HEN-DAY\nEGGS\nCumulative","HEN-HOUSED\nEGGS\nCumulative","MORT-ALITY\nCumulative\n(%)","BODY WEIGHT (kg)","FEED\nINTAKE\n(g / bird / day)","WATER CONSUMPTION (ml/bird/day)","HEN-HOUSED\nEGG MASS\nCumulative\n(kg)","AVG. EGG\nWEIGHT\n(g / egg)"]
["18","4–14","0.3–1.0","0.3–1.0","0.0","1.47 –1.57","82–88","123–176","0.0","48.8–50.0"]
["19","24–38","2.0–3.6","2.0–3.6","0.1","1.57 –1.67","85–91","128–182","0.1","49.0–51.0"]
["20","45–72","5.1–8.7","5.1 –8.7","0.1","1.63 –1.73","91–97","137–194","0.3","50.2–52.2"]
{"$rows_left_out":325}
{"sheet":"Performance Data","index":6,"n_rows":262,"n_cols":12,"rows_kept":262,"cut":false,"hidden":true,"merged":[]}
["Combined performance data tables for calculations"]
[]
["Table 1. All Layer Varieties Performance Data"]
["Source: ","Layer 01"]
["This table presents the combined performance data on layers taken from Hyline production guides"]
[]
["Flock Type","AGE (weeks)","Ration","Mortality (%)","Hen-Housed Eggs Cumulative Mid-point","Bodyweight Mid-point (kg)","Bodyweight Mid-point (g)","Feed Intake Mid-point (g/bird/day)","Feed Intake (g/bird/week)","Cumulative Feed Intake (g/bird)","Average Egg Weight Mid-point (g/egg)","Cumulative Egg Weight (g)"]
["Brown Free-range",16,{"$f":"IF(AND(Table13[[#This Row],[AGE (weeks)]]>='Diet input details'!$C$16,Table13[[#This Row],[AGE (weeks)]]<='Diet input details'!$D$16),\"Ration 1\",IF(AND(Table13[[#This Row],[AGE (weeks)]]>='Diet input details'!$C$17,Table13[[#This Row],[AGE (weeks)]]<='Diet input details'!$D$17),\"Ration 2\",IF(AND(Table13[[#This Row],[AGE (weeks)]]>='Diet input details'!$C$18,Table13[[#This Row],[AGE (weeks)]]<='Diet input details'!$D$18),\"Ration 3\",IF(AND(Table13[[#This Row],[AGE (weeks)]]>='Diet input details'!$C$19,Table13[[#This Row],[AGE (weeks)]]<='Diet input details'!$D$19),\"Ration 4\",IF(AND(Table13[[#This Row],[AGE (weeks)]]>='Diet input details'!$C$20,Table13[[#This Row],[AGE (weeks)]]<='Diet input details'!$D$20),\"Ration 5\", \"Clear\")))))","v":"Clear"},{"$f":"(VLOOKUP(Table13[[#This Row],[Ration]],Table22[#All],2,FALSE))","v":{"$error":"#N/A"}},0.3,1.55,{"$f":"Table13[[#This Row],[Bodyweight Mid-point (kg)]]*1000","v":1550},80.5,{"$f":"Table13[[#This Row],[Feed Intake Mid-point (g/bird/day)]]*7","v":563.5},{"$f":"Table13[[#This Row],[Feed Intake (g/bird/week)]]","v":563.5},47.65,{"$f":"(Table13[[#This Row],[Hen-Housed Eggs Cumulative Mid-point]]*Table13[[#This Row],[Average Egg Weight Mid-point (g/egg)]])","v":14.295}]
["Brown Free-range",17,{"$f":"IF(AND(Table13[[#This Row],[AGE (weeks)]]>='Diet input details'!$C$16,Table13[[#This Row],[AGE (weeks)]]<='Diet input details'!$D$16),\"Ration 1\",IF(AND(Table13[[#This Row],[AGE (weeks)]]>='Diet input details'!$C$17,Table13[[#This Row],[AGE (weeks)]]<='Diet input details'!$D$17),\"Ration 2\",IF(AND(Table13[[#This Row],[AGE (weeks)]]>='Diet input details'!$C$18,Table13[[#This Row],[AGE (weeks)]]<='Diet input details'!$D$18),\"Ration 3\",IF(AND(Table13[[#This Row],[AGE (weeks)]]>='Diet input details'!$C$19,Table13[[#This Row],[AGE (weeks)]]<='Diet input details'!$D$19),\"Ration 4\",IF(AND(Table13[[#This Row],[AGE (weeks)]]>='Diet input details'!$C$20,Table13[[#This Row],[AGE (weeks)]]<='Diet input details'!$D$20),\"Ration 5\", \"Clear\")))))","v":"Clear"},{"$f":"(VLOOKUP(Table13[[#This Row],[Ration]],Table22[#All],2,FALSE))","v":{"$error":"#N/A"}},0.3,1.55,{"$f":"Table13[[#This Row],[Bodyweight Mid-point (kg)]]*1000","v":1550},80.5,{"$f":"Table13[[#This Row],[Feed Intake Mid-point (g/bird/day)]]*7","v":563.5},{"$f":"Table13[[#This Row],[Feed Intake (g/bird/week)]]","v":563.5},47.65,{"$f":"(Table13[[#This Row],[Hen-Housed Eggs Cumulative Mid-point]]*Table13[[#This Row],[Average Egg Weight Mid-point (g/egg)]])","v":14.295}]
["Brown Free-range",18,{"$f":"IF(AND(Table13[[#This Row],[AGE (weeks)]]>='Diet input details'!$C$16,Table13[[#This Row],[AGE (weeks)]]<='Diet input details'!$D$16),\"Ration 1\",IF(AND(Table13[[#This Row],[AGE (weeks)]]>='Diet input details'!$C$17,Table13[[#This Row],[AGE (weeks)]]<='Diet input details'!$D$17),\"Ration 2\",IF(AND(Table13[[#This Row],[AGE (weeks)]]>='Diet input details'!$C$18,Table13[[#This Row],[AGE (weeks)]]<='Diet input details'!$D$18),\"Ration 3\",IF(AND(Table13[[#This Row],[AGE (weeks)]]>='Diet input details'!$C$19,Table13[[#This Row],[AGE (weeks)]]<='Diet input details'!$D$19),\"Ration 4\",IF(AND(Table13[[#This Row],[AGE (weeks)]]>='Diet input details'!$C$20,Table13[[#This Row],[AGE (weeks)]]<='Diet input details'!$D$20),\"Ration 5\", \"Clear\")))))","v":"Clear"},{"$f":"(VLOOKUP(Table13[[#This Row],[Ration]],Table22[#All],2,FALSE))","v":{"$error":"#N/A"}},0.3,1.55,{"$f":"Table13[[#This Row],[Bodyweight Mid-point (kg)]]*1000","v":1550},80.5,{"$f":"Table13[[#This Row],[Feed Intake Mid-point (g/bird/day)]]*7","v":563.5},{"$f":"Table13[[#This Row],[Feed Intake (g/bird/week)]]","v":563.5},47.65,{"$f":"(Table13[[#This Row],[Hen-Housed Eggs Cumulative Mid-point]]*Table13[[#This Row],[Average Egg Weight Mid-point (g/egg)]])","v":14.295}]
{"$rows_left_out":253}
{"sheet":"Dataset","index":7,"n_rows":143,"n_cols":11,"rows_kept":143,"cut":false,"hidden":true,"merged":[]}
["Calculations"]
[]
[]
["Table 1a. Bodyweight and Cumulative feed intake"]
["Source: ","Poultry 01","Hyline Performance Data"]
["This table contains the assumed bodyweights and cumulative feed intake for the animals based on the HyLine performance data sets and refer to the 'Performance Data' sheet"]
[]
["Diet type","Bodyweight (g)","Cum. feed intake (g) "]
[{"$f":"'Diet input details'!$B$6","v":"Ration 1"},{"$f":"(INDEX(Table13[Bodyweight Mid-point (g)],MATCH(1,('Flock input details'!$C$8='Performance Data'!$A$8:$A$262)*('Diet input details'!D16='Performance Data'!$B$8:$B$262),0)))*Table25[% of Target bodyweight]","v":{"$error":"#N/A"}},{"$f":"INDEX(Table13[Cumulative Feed Intake (g/bird)],MATCH(1,('Flock input details'!$C$8=Table13[Flock Type])*('Diet input details'!D16=Table13[AGE (weeks)]),0))","v":{"$error":"#N/A"}}]
[{"$f":"'Diet input details'!$B$7","v":"Ration 2"},{"$f":"(INDEX(Table13[Bodyweight Mid-point (g)],MATCH(1,('Flock input details'!$C$8='Performance Data'!$A$8:$A$262)*('Diet input details'!D17='Performance Data'!$B$8:$B$262),0)))*Table25[% of Target bodyweight]","v":{"$error":"#N/A"}},{"$f":"INDEX(Table13[Cumulative Feed Intake (g/bird)],MATCH(1,('Flock input details'!$C$8=Table13[Flock Type])*('Diet input details'!D17=Table13[AGE (weeks)]),0))","v":{"$error":"#N/A"}}]
{"$rows_left_out":133}